Reaction Details
TargetDelta-type opioid receptor
LigandBDBM50102711
Substrate/Competitorn/a
Meas. Tech.ChEMBL_147282 (CHEMBL755435)
Ki>300±n/a nM
Citation Thomas, JBAtkinson, RNRothman, RBFix, SEMascarella, SWVinson, NAXu, HDersch, CMLu, YCantrell, BEZimmerman, DMCarroll, FI Identification of the first trans-(3R,4R)- dimethyl-4-(3-hydroxyphenyl)piperidine derivative to possess highly potent and selective opioid kappa receptor antagonist activity. J Med Chem44:2687-90 (2001) Delta-type opioid receptor
Name:Delta-type opioid receptor
Type:G Protein-Coupled Receptor (GPCR)
Mol. Mass.:40382.98
Organism:Homo sapiens (Human)
Description:Competition binding assays were carried out using membrane preparations from transfected HN9.10 cells that constitutively expressed the delta opioid receptor.
Residue:372
BDBM50102711
NameBDBM50102711
Synonyms:7-Hydroxy-1,2,3,4-tetrahydro-isoquinoline-3-carboxylic acid {1-[4-(3-hydroxy-phenyl)-3,4-dimethyl-piperidin-1-ylmethyl]-2-methyl-propyl}-amide | CHEMBL51204
TypeSmall organic molecule
Emp. Form.C28H39N3O3
Mol. Mass.465.6276
SMILESCC(C)[C@@H](CN1CC[C@](C)([C@@H](C)C1)c1cccc(O)c1)NC(=O)C1Cc2ccc(O)cc2CN1