Reaction Details
TargetPotassium voltage-gated channel subfamily KQT member 2
LigandBDBM50130610
Substrate/Competitorn/a
Meas. Tech.ChEMBL_158550 (CHEMBL768693)
EC50 3000±n/a nM
Citation Wu, YJDavis, CDDworetzky, SFitzpatrick, WCHarden, DHe, HKnox, RJNewton, AEPhilip, TPolson, CSivarao, DVSun, LQTertyshnikova, SWeaver, DYeola, SZoeckler, MSinz, MW Fluorine substitution can block CYP3A4 metabolism-dependent inhibition: identification of (S)-N-[1-(4-fluoro-3- morpholin-4-ylphenyl)ethyl]-3- (4-fluorophenyl)acrylamide as an orally bioavailable KCNQ2 opener devoid of CYP3A4 metabolism-dependent inhibition. J Med Chem46:3778-81 (2003) 
 
Potassium voltage-gated channel subfamily KQT member 2
Name:Potassium voltage-gated channel subfamily KQT member 2
Type:PROTEIN
Mol. Mass.:95883.20
Organism:Homo sapiens (Human)
Description:ChEMBL_1457496
Residue:872
BDBM50130610
NameBDBM50130610
Synonyms:(E)-N-[(S)-1-(3-Morpholin-4-yl-phenyl)-ethyl]-3-phenyl-acrylamide CHEMBL317935 | N-[1-(3-Morpholin-4-yl-phenyl)-ethyl]-3-phenyl-acrylamide
TypeSmall organic molecule
Emp. Form.C21H24N2O2
Mol. Mass.336.4275
SMILESC[C@H](NC(=O)\C=C\c1ccccc1)c1cccc(c1)N1CCOCC1