Reaction Details
TargetCytochrome P450 3A4
LigandBDBM50131898
Substrate/Competitorn/a
Meas. Tech.ChEMBL_51927 (CHEMBL663575)
IC50 19000±n/a nM
Citation Wu, YJDavis, CDDworetzky, SFitzpatrick, WCHarden, DHe, HKnox, RJNewton, AEPhilip, TPolson, CSivarao, DVSun, LQTertyshnikova, SWeaver, DYeola, SZoeckler, MSinz, MW Fluorine substitution can block CYP3A4 metabolism-dependent inhibition: identification of (S)-N-[1-(4-fluoro-3- morpholin-4-ylphenyl)ethyl]-3- (4-fluorophenyl)acrylamide as an orally bioavailable KCNQ2 opener devoid of CYP3A4 metabolism-dependent inhibition. J Med Chem46:3778-81 (2003) 
 
Cytochrome P450 3A4
Name:Cytochrome P450 3A4
Type:Enzyme
Mol. Mass.:57349.57
Organism:Homo sapiens (Human)
Description:n/a
Residue:503
BDBM50131898
NameBDBM50131898
Synonyms:(E)-N-[1-((S)-4-Fluoro-3-morpholin-4-yl-phenyl)-ethyl]-3-(4-fluoro-phenyl)-acrylamide CHEMBL100379 | N-[1-(4-Fluoro-3-morpholin-4-yl-phenyl)-ethyl]-3-(4-fluoro-phenyl)-acrylamide
TypeSmall organic molecule
Emp. Form.C21H22F2N2O2
Mol. Mass.372.4084
SMILESC[C@H](NC(=O)\C=C\c1ccc(F)cc1)c1ccc(F)c(c1)N1CCOCC1