Reaction Details
TargetReverse transcriptase/RNaseH
LigandBDBM50168052
Substrate/Competitorn/a
Meas. Tech.ChEMBL_305565 (CHEMBL828584)
IC50 2300±n/a nM
Citation Ranise, ASpallarossa, ACesarini, SBondavalli, FSchenone, SBruno, OMenozzi, GFossa, PMosti, LLa Colla, MSanna, GMurreddu, MCollu, GBusonera, BMarongiu, MEPani, ALa Colla, PLoddo, R Structure-based design, parallel synthesis, structure-activity relationship, and molecular modeling studies of thiocarbamates, new potent non-nucleoside HIV-1 reverse transcriptase inhibitor isosteres of phenethylthiazolylthiourea derivatives. J Med Chem48:3858-73 (2005) 
 
Reverse transcriptase/RNaseH
Name:Reverse transcriptase/RNaseH
Type:PROTEIN
Mol. Mass.:65229.15
Organism:Human immunodeficiency virus 1
Description:ChEMBL_1473730
Residue:566
BDBM50168052
NameBDBM50168052
Synonyms:(4-Iodo-phenyl)-thiocarbamic acid 2-(1,3-dioxo-1,3-dihydro-isoindol-2-yl)-ethyl ester O-2-(1,3-dioxoisoindolin-2-yl)ethyl4-iodophenylcarbamothioate | O-[2-(1,3-dioxo-1,3-dihydro-2H-isoindol-2-yl)ethyl] (4-iodophenyl)thiocarbamate
TypeSmall organic molecule
Emp. Form.C17H13IN2O3S
Mol. Mass.452.266
SMILESIc1ccc(NC(=S)OCCN2C(=O)c3ccccc3C2=O)cc1