Reaction Details
TargetReverse transcriptase/RNaseH
LigandBDBM1866
Substrate/Competitorn/a
Meas. Tech.ChEMBL_305566 (CHEMBL827160)
IC50 15000±n/a nM
Citation Ranise, ASpallarossa, ACesarini, SBondavalli, FSchenone, SBruno, OMenozzi, GFossa, PMosti, LLa Colla, MSanna, GMurreddu, MCollu, GBusonera, BMarongiu, MEPani, ALa Colla, PLoddo, R Structure-based design, parallel synthesis, structure-activity relationship, and molecular modeling studies of thiocarbamates, new potent non-nucleoside HIV-1 reverse transcriptase inhibitor isosteres of phenethylthiazolylthiourea derivatives. J Med Chem48:3858-73 (2005) 
 
Reverse transcriptase/RNaseH
Name:Reverse transcriptase/RNaseH
Type:PROTEIN
Mol. Mass.:65229.15
Organism:Human immunodeficiency virus 1
Description:ChEMBL_1473730
Residue:566
BDBM1866
NameBDBM1866
Synonyms:3-(5-bromopyridin-2-yl)-1-[2-(pyridin-2-yl)ethyl]thiourea hydrochloride LY300046HCl PETT deriv. | Trovirdine
TypeSmall organic molecule
Emp. Form.C13H13BrN4S
Mol. Mass.337.238
SMILESBrc1ccc(NC(=S)NCCc2ccccn2)nc1