Reaction Details
TargetReverse transcriptase/RNaseH
LigandBDBM50168128
Substrate/Competitorn/a
Meas. Tech.ChEMBL_305327 (CHEMBL833548)
IC50 600±n/a nM
Citation Ranise, ASpallarossa, ACesarini, SBondavalli, FSchenone, SBruno, OMenozzi, GFossa, PMosti, LLa Colla, MSanna, GMurreddu, MCollu, GBusonera, BMarongiu, MEPani, ALa Colla, PLoddo, R Structure-based design, parallel synthesis, structure-activity relationship, and molecular modeling studies of thiocarbamates, new potent non-nucleoside HIV-1 reverse transcriptase inhibitor isosteres of phenethylthiazolylthiourea derivatives. J Med Chem48:3858-73 (2005) 
 
Reverse transcriptase/RNaseH
Name:Reverse transcriptase/RNaseH
Type:PROTEIN
Mol. Mass.:65229.15
Organism:Human immunodeficiency virus 1
Description:ChEMBL_1473730
Residue:566
BDBM50168128
NameBDBM50168128
Synonyms:CHEMBL191655 Phenyl-thiocarbamic acid 2-(1,3-dioxo-1,3-dihydro-isoindol-2-yl)-ethyl ester
TypeSmall organic molecule
Emp. Form.C17H14N2O3S
Mol. Mass.326.37
SMILESO=C1N(CCOC(=S)Nc2ccccc2)C(=O)c2ccccc12