Reaction Details
TargetCannabinoid receptor 2
LigandBDBM50072775
Substrate/Competitorn/a
Meas. Tech.ChEMBL_444839 (CHEMBL895094)
IC50 1.3±n/a nM
Citation Dziadulewicz, EKBevan, SJBrain, CTCoote, PRCulshaw, AJDavis, AJEdwards, LJFisher, AJFox, AJGentry, CGroarke, AHart, TWHuber, WJames, IFKesingland, ALa Vecchia, LLoong, YLyothier, IMcNair, KO'Farrell, CPeacock, MPortmann, RSchopfer, UYaqoob, MZadrobilek, J Naphthalen-1-yl-(4-pentyloxynaphthalen-1-yl)methanone: a potent, orally bioavailable human CB1/CB2 dual agonist with antihyperalgesic properties and restricted central nervous system penetration. J Med Chem50:3851-6 (2007) 
 
Cannabinoid receptor 2
Name:Cannabinoid receptor 2
Type:G Protein-Coupled Receptor (GPCR)
Mol. Mass.:39690.94
Organism:Homo sapiens (Human)
Description:P34972
Residue:360
BDBM50072775
NameBDBM50072775
Synonyms:2-((1R,2R,5R)-5-hydroxy-2-(3-hydroxypropyl)cyclohexyl)-5-(2-methyloctan-2-yl)phenol 5-(1,1-Dimethyl-heptyl)-2-[(4R,6R)-5-hydroxy-2-((R)-3-hydroxy-propyl)-cyclohexyl]-phenol CP-55940 CP55,940 ChEMBL_75020
TypeSmall organic molecule
Emp. Form.C24H40O3
Mol. Mass.376.5726
SMILESCCCCCCC(C)(C)c1ccc([C@@H]2C[C@H](O)CC[C@H]2CCCO)c(O)c1