Reaction Details
TargetcGMP-specific 3',5'-cyclic phosphodiesterase
LigandBDBM50207137
Substrate/Competitorn/a
Meas. Tech.ChEMBL_454819 (CHEMBL886847)
IC50 25±n/a nM
Citation Arnold, NJArnold, RBeer, DBhalay, GCollingwood, SPCraig, SDevereux, NDodds, MDunstan, ARFairhurst, RAFarr, DFullerton, JDGlen, AGomez, SHaberthuer, SHatto, JDHowes, CJones, DKeller, THLeuenberger, BMoser, HEMuller, INaef, RNicklin, PASandham, DATurner, KLTweed, MFWatson, SJZurini, M Potent and selective xanthine-based inhibitors of phosphodiesterase 5. Bioorg Med Chem Lett17:2376-9 (2007) 
 
cGMP-specific 3',5'-cyclic phosphodiesterase
Name:cGMP-specific 3',5'-cyclic phosphodiesterase
Type:Protein
Mol. Mass.:99975.83
Organism:Homo sapiens (Human)
Description:O76074
Residue:875
BDBM50207137
NameBDBM50207137
Synonyms:8-(bicyclo[2.2.1]heptan-2-ylmethyl)-3-isobutyl-1-methyl-1H-purine-2,6(3H,7H)-dione | CHEMBL247270
TypeSmall organic molecule
Emp. Form.C18H26N4O2
Mol. Mass.330.4246
SMILESCC(C)Cn1c2nc(CC3CC4CCC3C4)[nH]c2c(=O)n(C)c1=O