Reaction Details
TargetcGMP-specific 3',5'-cyclic phosphodiesterase
LigandBDBM50207129
Substrate/Competitorn/a
Meas. Tech.ChEMBL_454819 (CHEMBL886847)
IC50 33±n/a nM
Citation Arnold, NJArnold, RBeer, DBhalay, GCollingwood, SPCraig, SDevereux, NDodds, MDunstan, ARFairhurst, RAFarr, DFullerton, JDGlen, AGomez, SHaberthuer, SHatto, JDHowes, CJones, DKeller, THLeuenberger, BMoser, HEMuller, INaef, RNicklin, PASandham, DATurner, KLTweed, MFWatson, SJZurini, M Potent and selective xanthine-based inhibitors of phosphodiesterase 5. Bioorg Med Chem Lett17:2376-9 (2007) 
 
cGMP-specific 3',5'-cyclic phosphodiesterase
Name:cGMP-specific 3',5'-cyclic phosphodiesterase
Type:Protein
Mol. Mass.:99975.83
Organism:Homo sapiens (Human)
Description:O76074
Residue:875
BDBM50207129
NameBDBM50207129
Synonyms:3-(3,4-dimethoxybenzyl)-8-((6,7-dimethoxyisoquinolin-4-yl)methyl)-1-methyl-1H-purine-2,6(3H,7H)-dione | CHEMBL245842
TypeSmall organic molecule
Emp. Form.C27H27N5O6
Mol. Mass.517.5332
SMILESCOc1ccc(Cn2c3nc(Cc4cncc5cc(OC)c(OC)cc45)[nH]c3c(=O)n(C)c2=O)cc1OC