Reaction Details
TargetcGMP-specific 3',5'-cyclic phosphodiesterase
LigandBDBM50207128
Substrate/Competitorn/a
Meas. Tech.ChEMBL_454819 (CHEMBL886847)
IC50 42±n/a nM
Citation Arnold, NJArnold, RBeer, DBhalay, GCollingwood, SPCraig, SDevereux, NDodds, MDunstan, ARFairhurst, RAFarr, DFullerton, JDGlen, AGomez, SHaberthuer, SHatto, JDHowes, CJones, DKeller, THLeuenberger, BMoser, HEMuller, INaef, RNicklin, PASandham, DATurner, KLTweed, MFWatson, SJZurini, M Potent and selective xanthine-based inhibitors of phosphodiesterase 5. Bioorg Med Chem Lett17:2376-9 (2007) 
 
cGMP-specific 3',5'-cyclic phosphodiesterase
Name:cGMP-specific 3',5'-cyclic phosphodiesterase
Type:Protein
Mol. Mass.:99975.83
Organism:Homo sapiens (Human)
Description:O76074
Residue:875
BDBM50207128
NameBDBM50207128
Synonyms:CHEMBL393913 | N-(4-((8-((6,7-dimethoxyisoquinolin-4-yl)methyl)-1-methyl-2,6-dioxo-1,6-dihydro-2H-purin-3(7H)-yl)methyl)phenyl)acetamide
TypeSmall organic molecule
Emp. Form.C27H26N6O5
Mol. Mass.514.5325
SMILESCOc1cc2cncc(Cc3nc4n(Cc5ccc(NC(C)=O)cc5)c(=O)n(C)c(=O)c4[nH]3)c2cc1OC