Reaction Details
TargetAurora kinase A
LigandBDBM50372020
Substrate/Competitorn/a
Meas. Tech.ChEMBL_464494 (CHEMBL931996)
IC50 15200±n/a nM
Citation Coumar, MSWu, JSLeou, JSTan, UKChang, CYChang, TYLin, WHHsu, JTChao, YSWu, SYHsieh, HP Aurora kinase A inhibitors: identification, SAR exploration and molecular modeling of 6,7-dihydro-4H-pyrazolo-[1,5-a]pyrrolo[3,4-d]pyrimidine-5,8-dione scaffold. Bioorg Med Chem Lett18:1623-7 (2008) 
 
Aurora kinase A
Name:Aurora kinase A
Type:Serine/threonine-protein kinase
Mol. Mass.:45830.98
Organism:Homo sapiens (Human)
Description:O14965
Residue:403
BDBM50372020
NameBDBM50372020
Synonyms:CHEMBL439417
TypeSmall organic molecule
Emp. Form.C20H16N4O4
Mol. Mass.376.3654
SMILESCOc1cccc(CN2Cc3c(nc4cc([nH]n4c3=O)-c3ccco3)C2=O)c1