Reaction Details
TargetSubstance-P receptor
LigandBDBM50372486
Substrate/Competitorn/a
Meas. Tech.ChEMBL_465010 (CHEMBL929512)
IC50 0.27±n/a nM
Citation Morriello, GJDevita, RJMills, SGYoung, JRLin, PDoss, GChicchi, GGDemartino, JKurtz, MMTsao, KLCarlson, ETownson, KWheeldon, ABoyce, SCollinson, NRupniak, NMoore, S Fused bicyclic pyrrolizinones as new scaffolds for human NK1 antagonists. Bioorg Med Chem16:2156-70 (2008) 
 
Substance-P receptor
Name:Substance-P receptor
Type:G Protein-Coupled Receptor (GPCR)
Mol. Mass.:46254.43
Organism:Homo sapiens (Human)
Description:P25103
Residue:407
BDBM50372486
NameBDBM50372486
Synonyms:CHEMBL272569
TypeSmall organic molecule
Emp. Form.C22H19F6NO3
Mol. Mass.459.3816
SMILESC[C@@H](O[C@H]1CN2[C@H](COC2=O)[C@@H]1c1ccccc1)c1cc(cc(c1)C(F)(F)F)C(F)(F)F