Reaction Details
TargetNociceptin receptor
LigandBDBM50373375
Substrate/Competitorn/a
Meas. Tech.ChEMBL_467784 (CHEMBL931348)
IC50 23±n/a nM
Citation Okamoto, OKobayashi, KKawamoto, HIto, SSatoh, AKato, TYamamoto, IMizutani, SHashimoto, MShimizu, ASakoh, HNagatomi, YIwasawa, YTakahashi, HIshii, YOzaki, SOhta, H Identification of novel benzimidazole series of potent and selective ORL1 antagonists. Bioorg Med Chem Lett18:3278-81 (2008) 
 
Nociceptin receptor
Name:Nociceptin receptor
Type:G Protein-Coupled Receptor (GPCR)
Mol. Mass.:40702.87
Organism:Homo sapiens (Human)
Description:P41146
Residue:370
BDBM50373375
NameBDBM50373375
Synonyms:CHEMBL260821
TypeSmall organic molecule
Emp. Form.C18H18ClFN4S
Mol. Mass.376.879
SMILESFc1cc2nc(SCc3ccccc3Cl)[nH]c2cc1N1CCNCC1