Reaction Details
TargetNociceptin receptor
LigandBDBM50373359
Substrate/Competitorn/a
Meas. Tech.ChEMBL_467784 (CHEMBL931348)
IC50 910±n/a nM
Citation Okamoto, OKobayashi, KKawamoto, HIto, SSatoh, AKato, TYamamoto, IMizutani, SHashimoto, MShimizu, ASakoh, HNagatomi, YIwasawa, YTakahashi, HIshii, YOzaki, SOhta, H Identification of novel benzimidazole series of potent and selective ORL1 antagonists. Bioorg Med Chem Lett18:3278-81 (2008) 
 
Nociceptin receptor
Name:Nociceptin receptor
Type:G Protein-Coupled Receptor (GPCR)
Mol. Mass.:40702.87
Organism:Homo sapiens (Human)
Description:P41146
Residue:370
BDBM50373359
NameBDBM50373359
Synonyms:CHEMBL258746
TypeSmall organic molecule
Emp. Form.C19H20F2N4S
Mol. Mass.374.451
SMILESCN1CCN(CC1)c1cc2[nH]c(SCc3ccc(F)cc3)nc2cc1F