Reaction Details
TargetNociceptin receptor
LigandBDBM50373363
Substrate/Competitorn/a
Meas. Tech.ChEMBL_467784 (CHEMBL931348)
IC50 120±n/a nM
Citation Okamoto, OKobayashi, KKawamoto, HIto, SSatoh, AKato, TYamamoto, IMizutani, SHashimoto, MShimizu, ASakoh, HNagatomi, YIwasawa, YTakahashi, HIshii, YOzaki, SOhta, H Identification of novel benzimidazole series of potent and selective ORL1 antagonists. Bioorg Med Chem Lett18:3278-81 (2008) 
 
Nociceptin receptor
Name:Nociceptin receptor
Type:G Protein-Coupled Receptor (GPCR)
Mol. Mass.:40702.87
Organism:Homo sapiens (Human)
Description:P41146
Residue:370
BDBM50373363
NameBDBM50373363
Synonyms:CHEMBL263904
TypeSmall organic molecule
Emp. Form.C16H23ClN4OS
Mol. Mass.354.898
SMILESCC(C)Sc1nc2cc(Cl)c(cc2[nH]1)N1CCN(CCO)CC1