Reaction Details
TargetNociceptin receptor
LigandBDBM50373372
Substrate/Competitorn/a
Meas. Tech.ChEMBL_467784 (CHEMBL931348)
IC50 2900±n/a nM
Citation Okamoto, OKobayashi, KKawamoto, HIto, SSatoh, AKato, TYamamoto, IMizutani, SHashimoto, MShimizu, ASakoh, HNagatomi, YIwasawa, YTakahashi, HIshii, YOzaki, SOhta, H Identification of novel benzimidazole series of potent and selective ORL1 antagonists. Bioorg Med Chem Lett18:3278-81 (2008) 
 
Nociceptin receptor
Name:Nociceptin receptor
Type:G Protein-Coupled Receptor (GPCR)
Mol. Mass.:40702.87
Organism:Homo sapiens (Human)
Description:P41146
Residue:370
BDBM50373372
NameBDBM50373372
Synonyms:CHEMBL410124
TypeSmall organic molecule
Emp. Form.C18H17Cl2FN4OS
Mol. Mass.427.323
SMILESFc1cc2nc([nH]c2cc1N1CCNCC1)S(=O)Cc1cccc(Cl)c1Cl