Reaction Details
TargetNociceptin receptor
LigandBDBM50373376
Substrate/Competitorn/a
Meas. Tech.ChEMBL_467784 (CHEMBL931348)
IC50 31±n/a nM
Citation Okamoto, OKobayashi, KKawamoto, HIto, SSatoh, AKato, TYamamoto, IMizutani, SHashimoto, MShimizu, ASakoh, HNagatomi, YIwasawa, YTakahashi, HIshii, YOzaki, SOhta, H Identification of novel benzimidazole series of potent and selective ORL1 antagonists. Bioorg Med Chem Lett18:3278-81 (2008) 
 
Nociceptin receptor
Name:Nociceptin receptor
Type:G Protein-Coupled Receptor (GPCR)
Mol. Mass.:40702.87
Organism:Homo sapiens (Human)
Description:P41146
Residue:370
BDBM50373376
NameBDBM50373376
Synonyms:CHEMBL407653
TypeSmall organic molecule
Emp. Form.C19H21FN4S
Mol. Mass.356.46
SMILESCc1ccc(CSc2nc3cc(F)c(cc3[nH]2)N2CCNCC2)cc1