Reaction Details
TargetNociceptin receptor
LigandBDBM50373381
Substrate/Competitorn/a
Meas. Tech.ChEMBL_467784 (CHEMBL931348)
IC50 63±n/a nM
Citation Okamoto, OKobayashi, KKawamoto, HIto, SSatoh, AKato, TYamamoto, IMizutani, SHashimoto, MShimizu, ASakoh, HNagatomi, YIwasawa, YTakahashi, HIshii, YOzaki, SOhta, H Identification of novel benzimidazole series of potent and selective ORL1 antagonists. Bioorg Med Chem Lett18:3278-81 (2008) 
 
Nociceptin receptor
Name:Nociceptin receptor
Type:G Protein-Coupled Receptor (GPCR)
Mol. Mass.:40702.87
Organism:Homo sapiens (Human)
Description:P41146
Residue:370
BDBM50373381
NameBDBM50373381
Synonyms:CHEMBL259065
TypeSmall organic molecule
Emp. Form.C18H18F2N4S
Mol. Mass.360.424
SMILESFc1ccc(CSc2nc3cc(F)c(cc3[nH]2)N2CCNCC2)cc1