Reaction Details
TargetNociceptin receptor
LigandBDBM50373382
Substrate/Competitorn/a
Meas. Tech.ChEMBL_467784 (CHEMBL931348)
IC50>10000±n/a nM
Citation Okamoto, OKobayashi, KKawamoto, HIto, SSatoh, AKato, TYamamoto, IMizutani, SHashimoto, MShimizu, ASakoh, HNagatomi, YIwasawa, YTakahashi, HIshii, YOzaki, SOhta, H Identification of novel benzimidazole series of potent and selective ORL1 antagonists. Bioorg Med Chem Lett18:3278-81 (2008) 
 
Nociceptin receptor
Name:Nociceptin receptor
Type:G Protein-Coupled Receptor (GPCR)
Mol. Mass.:40702.87
Organism:Homo sapiens (Human)
Description:P41146
Residue:370
BDBM50373382
NameBDBM50373382
Synonyms:CHEMBL259066
TypeSmall organic molecule
Emp. Form.C27H34F2N4S
Mol. Mass.484.647
SMILESFc1ccc(CSc2nc3cc(F)c(cc3[nH]2)N2CCN(CC3CCCCCCC3)CC2)cc1