Reaction Details
TargetNociceptin receptor
LigandBDBM50373361
Substrate/Competitorn/a
Meas. Tech.ChEMBL_467785 (CHEMBL931349)
IC50 20±n/a nM
Citation Okamoto, OKobayashi, KKawamoto, HIto, SSatoh, AKato, TYamamoto, IMizutani, SHashimoto, MShimizu, ASakoh, HNagatomi, YIwasawa, YTakahashi, HIshii, YOzaki, SOhta, H Identification of novel benzimidazole series of potent and selective ORL1 antagonists. Bioorg Med Chem Lett18:3278-81 (2008) 
 
Nociceptin receptor
Name:Nociceptin receptor
Type:G Protein-Coupled Receptor (GPCR)
Mol. Mass.:40702.87
Organism:Homo sapiens (Human)
Description:P41146
Residue:370
BDBM50373361
NameBDBM50373361
Synonyms:CHEMBL408901
TypeSmall organic molecule
Emp. Form.C19H27ClN4OS
Mol. Mass.394.962
SMILESOCCN1CCN(CC1)c1cc2[nH]c(SC3CCCCC3)nc2cc1Cl