Reaction Details
TargetMelanocortin receptor 5
LigandBDBM50121900
Substrate/Competitorn/a
Meas. Tech.ChEMBL_469797 (CHEMBL932307)
EC50 0.078±n/a nM
Citation Hess, SLinde, YOvadia, OSafrai, EShalev, DESwed, AHalbfinger, ELapidot, TWinkler, IGabinet, YFaier, AYarden, DXiang, ZPortillo, FPHaskell-Luevano, CGilon, CHoffman, A Backbone cyclic peptidomimetic melanocortin-4 receptor agonist as a novel orally administrated drug lead for treating obesity. J Med Chem51:1026-34 (2008) 
 
Melanocortin receptor 5
Name:Melanocortin receptor 5
Type:Enzyme
Mol. Mass.:36966.58
Organism:Mus musculus (Mouse)
Description:P41149
Residue:325
BDBM50121900
NameBDBM50121900
Synonyms:Ac-Ser-Try-Ser-Nle-Glu-His-DPhe-Arg-Trp-Gly-Lys-Pro-Val-NH2 | CHEMBL439490
TypeSmall organic molecule
Emp. Form.C78H111N21O19
Mol. Mass.1646.8452
SMILESCCCC[C@H](NC(=O)C(CO)NC(=O)[C@H](Cc1ccc(O)cc1)NC(=O)[C@H](CO)NC(C)=O)C(=O)N[C@@H](CCC(O)=O)C(=O)N[C@@H](Cc1cnc[nH]1)C(=O)N[C@H](Cc1ccccc1)C(=O)N[C@@H](CCCNC(N)=N)C(=O)N[C@@H](Cc1c[nH]c2ccccc12)C(=O)NCC(=O)N[C@@H](CCCCN)C(=O)N1CCC[C@@H]1C(=O)N[C@H](C(C)C)C(N)=O