Reaction Details
TargetMacrophage colony-stimulating factor 1 receptor
LigandBDBM27917
Substrate/Competitorn/a
Meas. Tech.ChEMBL_479297 (CHEMBL933669)
IC50 0.8±n/a nM
Citation Meegalla, SKWall, MJChen, JWilson, KJBallentine, SKDesjarlais, RLSchubert, CCrysler, CSChen, YMolloy, CJChaikin, MAManthey, CLPlayer, MRTomczuk, BEIllig, CR Structure-based optimization of a potent class of arylamide FMS inhibitors. Bioorg Med Chem Lett18:3632-7 (2008) 
 
Macrophage colony-stimulating factor 1 receptor
Name:Macrophage colony-stimulating factor 1 receptor
Type:Protein
Mol. Mass.:107979.48
Organism:Homo sapiens (Human)
Description:P07333
Residue:972
BDBM27917
NameBDBM27917
Synonyms:4-cyano-N-[4-(4-methylpiperazin-1-yl)-2-(4-methylpiperidin-1-yl)phenyl]-1H-pyrrole-2-carboxamide arylamide, 8
TypeSmall organic molecule
Emp. Form.C23H30N6O
Mol. Mass.406.5239
SMILESCC1CCN(CC1)c1cc(ccc1NC(=O)c1cc(c[nH]1)C#N)N1CCN(C)CC1