Reaction Details
TargetGlycogen synthase kinase-3 alpha
LigandBDBM50377235
Substrate/Competitorn/a
Meas. Tech.ChEMBL_479409 (CHEMBL928211)
IC50 9±n/a nM
Citation Lum, CKahl, JKessler, LKucharski, JLundström, JMiller, SNakanishi, HPei, YPryor, KRoberts, ESebo, LSullivan, RUrban, JWang, Z 2,5-Diaminopyrimidines and 3,5-disubstituted azapurines as inhibitors of glycogen synthase kinase-3 (GSK-3). Bioorg Med Chem Lett18:3578-81 (2008) 
 
Glycogen synthase kinase-3 alpha
Name:Glycogen synthase kinase-3 alpha
Type:Enzyme
Mol. Mass.:50991.79
Organism:Homo sapiens (Human)
Description:P49840
Residue:483
BDBM50377235
NameBDBM50377235
Synonyms:CHEMBL402541
TypeSmall organic molecule
Emp. Form.C18H14N6O3
Mol. Mass.362.3422
SMILESOC(=O)COc1ccc(Nc2ncc3nnn(-c4ccccc4)c3n2)cc1