Reaction Details
TargetGlycogen synthase kinase-3 alpha
LigandBDBM50377239
Substrate/Competitorn/a
Meas. Tech.ChEMBL_479409 (CHEMBL928211)
IC50 172±n/a nM
Citation Lum, CKahl, JKessler, LKucharski, JLundström, JMiller, SNakanishi, HPei, YPryor, KRoberts, ESebo, LSullivan, RUrban, JWang, Z 2,5-Diaminopyrimidines and 3,5-disubstituted azapurines as inhibitors of glycogen synthase kinase-3 (GSK-3). Bioorg Med Chem Lett18:3578-81 (2008) 
 
Glycogen synthase kinase-3 alpha
Name:Glycogen synthase kinase-3 alpha
Type:Enzyme
Mol. Mass.:50991.79
Organism:Homo sapiens (Human)
Description:P49840
Residue:483
BDBM50377239
NameBDBM50377239
Synonyms:CHEMBL256517
TypeSmall organic molecule
Emp. Form.C16H19N5O3
Mol. Mass.329.3538
SMILESO[C@H]1CC[C@@H](CC1)Nc1ncc(c(Nc2ccccc2)n1)[N+]([O-])=O