Reaction Details
TargetGlycogen synthase kinase-3 alpha
LigandBDBM50377240
Substrate/Competitorn/a
Meas. Tech.ChEMBL_479409 (CHEMBL928211)
IC50 20±n/a nM
Citation Lum, CKahl, JKessler, LKucharski, JLundström, JMiller, SNakanishi, HPei, YPryor, KRoberts, ESebo, LSullivan, RUrban, JWang, Z 2,5-Diaminopyrimidines and 3,5-disubstituted azapurines as inhibitors of glycogen synthase kinase-3 (GSK-3). Bioorg Med Chem Lett18:3578-81 (2008) 
 
Glycogen synthase kinase-3 alpha
Name:Glycogen synthase kinase-3 alpha
Type:Enzyme
Mol. Mass.:50991.79
Organism:Homo sapiens (Human)
Description:P49840
Residue:483
BDBM50377240
NameBDBM50377240
Synonyms:CHEMBL404565
TypeSmall organic molecule
Emp. Form.C19H16N6O2
Mol. Mass.360.3693
SMILESOC(=O)CCc1ccc(Nc2ncc3nnn(-c4ccccc4)c3n2)cc1