Reaction Details
TargetGlycogen synthase kinase-3 alpha
LigandBDBM50377242
Substrate/Competitorn/a
Meas. Tech.ChEMBL_479409 (CHEMBL928211)
IC50 330±n/a nM
Citation Lum, CKahl, JKessler, LKucharski, JLundström, JMiller, SNakanishi, HPei, YPryor, KRoberts, ESebo, LSullivan, RUrban, JWang, Z 2,5-Diaminopyrimidines and 3,5-disubstituted azapurines as inhibitors of glycogen synthase kinase-3 (GSK-3). Bioorg Med Chem Lett18:3578-81 (2008) 
 
Glycogen synthase kinase-3 alpha
Name:Glycogen synthase kinase-3 alpha
Type:Enzyme
Mol. Mass.:50991.79
Organism:Homo sapiens (Human)
Description:P49840
Residue:483
BDBM50377242
NameBDBM50377242
Synonyms:CHEMBL256518
TypeSmall organic molecule
Emp. Form.C16H12N6
Mol. Mass.288.3067
SMILESN(c1ccccc1)c1ncc2nnn(-c3ccccc3)c2n1