Reaction Details
TargetGlycogen synthase kinase-3 beta
LigandBDBM50377233
Substrate/Competitorn/a
Meas. Tech.ChEMBL_479408 (CHEMBL928210)
IC50 477±n/a nM
Citation Lum, CKahl, JKessler, LKucharski, JLundström, JMiller, SNakanishi, HPei, YPryor, KRoberts, ESebo, LSullivan, RUrban, JWang, Z 2,5-Diaminopyrimidines and 3,5-disubstituted azapurines as inhibitors of glycogen synthase kinase-3 (GSK-3). Bioorg Med Chem Lett18:3578-81 (2008) 
 
Glycogen synthase kinase-3 beta
Name:Glycogen synthase kinase-3 beta
Type:Enzyme
Mol. Mass.:46756.38
Organism:Homo sapiens (Human)
Description:P49841
Residue:420
BDBM50377233
NameBDBM50377233
Synonyms:CHEMBL404242
TypeSmall organic molecule
Emp. Form.C19H16N6O3
Mol. Mass.376.3687
SMILESCOC(=O)COc1ccc(Nc2ncc3nnn(-c4ccccc4)c3n2)cc1