Reaction Details
TargetGlycogen synthase kinase-3 beta
LigandBDBM50377238
Substrate/Competitorn/a
Meas. Tech.ChEMBL_479408 (CHEMBL928210)
IC50 279±n/a nM
Citation Lum, CKahl, JKessler, LKucharski, JLundström, JMiller, SNakanishi, HPei, YPryor, KRoberts, ESebo, LSullivan, RUrban, JWang, Z 2,5-Diaminopyrimidines and 3,5-disubstituted azapurines as inhibitors of glycogen synthase kinase-3 (GSK-3). Bioorg Med Chem Lett18:3578-81 (2008) 
 
Glycogen synthase kinase-3 beta
Name:Glycogen synthase kinase-3 beta
Type:Enzyme
Mol. Mass.:46756.38
Organism:Homo sapiens (Human)
Description:P49841
Residue:420
BDBM50377238
NameBDBM50377238
Synonyms:CHEMBL255948
TypeSmall organic molecule
Emp. Form.C16H18N6O
Mol. Mass.310.3537
SMILESO[C@H]1CC[C@@H](CC1)Nc1ncc2nnn(-c3ccccc3)c2n1