Reaction Details
TargetGlycogen synthase kinase-3 beta
LigandBDBM50377257
Substrate/Competitorn/a
Meas. Tech.ChEMBL_479408 (CHEMBL928210)
IC50 3200±n/a nM
Citation Lum, CKahl, JKessler, LKucharski, JLundström, JMiller, SNakanishi, HPei, YPryor, KRoberts, ESebo, LSullivan, RUrban, JWang, Z 2,5-Diaminopyrimidines and 3,5-disubstituted azapurines as inhibitors of glycogen synthase kinase-3 (GSK-3). Bioorg Med Chem Lett18:3578-81 (2008) 
 
Glycogen synthase kinase-3 beta
Name:Glycogen synthase kinase-3 beta
Type:Enzyme
Mol. Mass.:46756.38
Organism:Homo sapiens (Human)
Description:P49841
Residue:420
BDBM50377257
NameBDBM50377257
Synonyms:CHEMBL404687
TypeSmall organic molecule
Emp. Form.C17H13BrN4O2
Mol. Mass.385.215
SMILESOC(=O)c1ccc(Nc2ncc(Br)c(Nc3ccccc3)n2)cc1