Reaction Details
TargetGlycogen synthase kinase-3 beta
LigandBDBM50377260
Substrate/Competitorn/a
Meas. Tech.ChEMBL_479408 (CHEMBL928210)
IC50 960±n/a nM
Citation Lum, CKahl, JKessler, LKucharski, JLundström, JMiller, SNakanishi, HPei, YPryor, KRoberts, ESebo, LSullivan, RUrban, JWang, Z 2,5-Diaminopyrimidines and 3,5-disubstituted azapurines as inhibitors of glycogen synthase kinase-3 (GSK-3). Bioorg Med Chem Lett18:3578-81 (2008) 
 
Glycogen synthase kinase-3 beta
Name:Glycogen synthase kinase-3 beta
Type:Enzyme
Mol. Mass.:46756.38
Organism:Homo sapiens (Human)
Description:P49841
Residue:420
BDBM50377260
NameBDBM50377260
Synonyms:CHEMBL401918
TypeSmall organic molecule
Emp. Form.C19H15N5O3
Mol. Mass.361.3541
SMILESCn1n(-c2ccccc2)c2nc(Nc3ccc(cc3)C(O)=O)ncc2c1=O