Reaction Details
TargetCholinesterase
LigandBDBM50262341
Substrate/Competitorn/a
Meas. Tech.ChEMBL_514382 (CHEMBL967996)
IC50>100000±n/a nM
Citation León, Rde los Ríos, CMarco-Contelles, JHuertas, OBarril, XLuque, FJLópez, MGGarcía, AGVillarroya, M New tacrine-dihydropyridine hybrids that inhibit acetylcholinesterase, calcium entry, and exhibit neuroprotection properties. Bioorg Med Chem16:7759-69 (2008) 
 
Cholinesterase
Name:Cholinesterase
Type:Homotetramer
Mol. Mass.:68422.27
Organism:Homo sapiens (Human)
Description:P06276
Residue:602
BDBM50262341
NameBDBM50262341
Synonyms:11-Amino-12-(4-methoxy-phenyl)-3,3-dimethyl-3,4,5,7,8,9,10,12-octahydro-2H-dibenzo[b,g][1,8]naphthyridin-1-one | CHEMBL468001
TypeSmall organic molecule
Emp. Form.C25H29N3O2
Mol. Mass.403.5167
SMILESCOc1ccc(cc1)C1C2C(=O)CC(C)(C)CC2=Nc2nc3CCCCc3c(N)c12