Reaction Details
TargetCytochrome P450 3A4
LigandBDBM50292985
Substrate/Competitorn/a
Meas. Tech.ChEMBL_495542 (CHEMBL996821)
IC50 36000±n/a nM
Citation Westaway, SMBrown, SLFell, SCJohnson, CNMacPherson, DTMitchell, DJMyatt, JWStanway, SJSeal, JTStemp, GThompson, MLawless, KMcKay, FMuir, AIBarford, JMCluff, CMahmood, SRMatthews, KLMohamed, SSmith, BStevens, AJBolton, VJJarvie, EMSanger, GJ Discovery of N-(3-fluorophenyl)-1-[(4-([(3S)-3-methyl-1-piperazinyl]methyl)phenyl)acetyl]-4-piperidinamine (GSK962040), the first small molecule motilin receptor agonist clinical candidate. J Med Chem52:1180-9 (2009) 
 
Cytochrome P450 3A4
Name:Cytochrome P450 3A4
Type:Enzyme
Mol. Mass.:57349.57
Organism:Homo sapiens (Human)
Description:n/a
Residue:503
BDBM50292985
NameBDBM50292985
Synonyms:3-((1-[(4-([(3S)-3-Methyl-1-piperazinyl]methyl)phenyl)acetyl]-4-piperidinyl)amino)benzonitrile | CHEMBL489480
TypeSmall organic molecule
Emp. Form.C26H33N5O
Mol. Mass.431.5731
SMILESC[C@H]1CN(Cc2ccc(CC(=O)N3CCC(CC3)Nc3cccc(c3)C#N)cc2)CCN1