Reaction Details
Target11-beta-hydroxysteroid dehydrogenase 1
LigandBDBM50243633
Substrate/Competitorn/a
Meas. Tech.ChEMBL_543487 (CHEMBL1018653)
IC50 1.3±n/a nM
Citation McMinn, DLRew, YSudom, ACaille, SDegraffenreid, MHe, XHungate, RJiang, BJaen, JJulian, LDKaizerman, JNovak, PSun, DTu, HUrsu, SWalker, NPYan, XYe, QWang, ZPowers, JP Optimization of novel di-substituted cyclohexylbenzamide derivatives as potent 11 beta-HSD1 inhibitors. Bioorg Med Chem Lett19:1446-50 (2009) 
 
11-beta-hydroxysteroid dehydrogenase 1
Name:11-beta-hydroxysteroid dehydrogenase 1
Type:Enzyme
Mol. Mass.:32409.16
Organism:Homo sapiens (Human)
Description:P28845
Residue:292
BDBM50243633
NameBDBM50243633
Synonyms:(S)-N-(trans-4-Phenyl)cyclohexyl-4-(1,1,1-trifluoro-2-hydroxypropan-2-yl)-N-cyclopropylbenzamide N-cyclopropyl-N-((1r,4S)-4-phenylcyclohexyl)-4-((S)-1,1,1-trifluoro-2-hydroxypropan-2-yl)benzamide
TypeSmall organic molecule
Emp. Form.C25H28F3NO2
Mol. Mass.431.4905
SMILESC[C@](O)(c1ccc(cc1)C(=O)N(C1CC1)[C@H]1CC[C@@H](CC1)c1ccccc1)C(F)(F)F