Reaction Details
TargetEpidermal growth factor receptor
LigandBDBM50299491
Substrate/Competitorn/a
Meas. Tech.ChEMBL_591074 (CHEMBL1052827)
IC50 23±n/a nM
Citation Gavai, AVFink, BEFairfax, DJMartin, GSRossiter, LMHolst, CLKim, SHLeavitt, KJMastalerz, HHan, WCNorris, DGoyal, BSwaminathan, SPatel, BMathur, AVyas, DMTokarski, JSYu, COppenheimer, SZhang, HMarathe, PFargnoli, JLee, FYWong, TWVite, GD Discovery and preclinical evaluation of [4-[[1-(3-fluorophenyl)methyl]-1H-indazol-5-ylamino]-5-methylpyrrolo[2,1-f][1,2,4]triazin-6-yl]carbamic acid, (3S)-3-morpholinylmethyl ester (BMS-599626), a selective and orally efficacious inhibitor of human epidermal growth factor receptor 1 and 2 kinases. J Med Chem52:6527-30 (2009) 
 
Epidermal growth factor receptor
Name:Epidermal growth factor receptor
Type:Receptor Kinase Domain
Mol. Mass.:134279.59
Organism:Homo sapiens (Human)
Description:P00533
Residue:1210
BDBM50299491
NameBDBM50299491
Synonyms:CHEMBL583403 | [4-[[1-(3-fluorophenyl)methyl]-1H-indazol-5-ylamino]-5-ethyl-pyrrolo[2,1-f][1,2,4]triazin-6-yl]-carbamic acid,(3S)-3-morpholinylmethyl ester
TypeSmall organic molecule
Emp. Form.C28H29FN8O3
Mol. Mass.544.5801
SMILESCCC1=C2C(N=C1NC(=O)OC[C@@H]1COCCN1)N=CN=C2Nc1ccc2n(Cc3cccc(F)c3)ncc2c1