Reaction Details
TargetSialidase
LigandBDBM50304350
Substrate/Competitorn/a
Meas. Tech.ChEMBL_606760 (CHEMBL1065350)
IC50 1400±n/a nM
Citation Jeong, HJRyu, YBPark, SJKim, JHKwon, HJKim, JHPark, KHRho, MCLee, WS Neuraminidase inhibitory activities of flavonols isolated from Rhodiola rosea roots and their in vitro anti-influenza viral activities. Bioorg Med Chem17:6816-23 (2009) 
 
Sialidase
Name:Sialidase
Type:PROTEIN
Mol. Mass.:42808.79
Organism:Clostridium perfringens
Description:ChEMBL_991336
Residue:382
BDBM50304350
NameBDBM50304350
Synonyms:CHEMBL611029 | Herbacetin
TypeSmall organic molecule
Emp. Form.C15H10O7
Mol. Mass.302.2357
SMILESOc1ccc(cc1)-c1oc2c(O)c(O)cc(O)c2c(=O)c1O