Reaction Details
TargetTyrosine-protein phosphatase non-receptor type 1
LigandBDBM50311574
Substrate/Competitorn/a
Meas. Tech.ChEMBL_618616 (CHEMBL1101504)
IC50>30000±n/a nM
Citation Nguyen, PHLe, TVThuong, PTDao, TTNdinteh, DTMbafor, JTKang, KWOh, WK Cytotoxic and PTP1B inhibitory activities from Erythrina abyssinica. Bioorg Med Chem Lett19:6745-9 (2009) 
 
Tyrosine-protein phosphatase non-receptor type 1
Name:Tyrosine-protein phosphatase non-receptor type 1
Type:Protein phosphatase
Mol. Mass.:49963.76
Organism:Homo sapiens (Human)
Description:Human recombinant GST-fusion PTP1B (1-435).
Residue:435
BDBM50311574
NameBDBM50311574
Synonyms:CHEMBL1079407 | Erythribyssin C
TypeSmall organic molecule
Emp. Form.C22H24O5
Mol. Mass.368.423
SMILES[#6]-[#8]-c1cc2-[#6@@H]-3-[#6]-[#8]-c4cc(-[#8]-[#6])c(-[#6]\[#6]=[#6](\[#6])-[#6])cc4-[#6@@H]-3-[#8]-c2cc1-[#8]