Reaction Details
TargetTyrosine-protein phosphatase non-receptor type 1
LigandBDBM50317432
Substrate/Competitorn/a
Meas. Tech.ChEMBL_618616 (CHEMBL1101504)
IC50 7600±n/a nM
Citation Nguyen, PHLe, TVThuong, PTDao, TTNdinteh, DTMbafor, JTKang, KWOh, WK Cytotoxic and PTP1B inhibitory activities from Erythrina abyssinica. Bioorg Med Chem Lett19:6745-9 (2009) 
 
Tyrosine-protein phosphatase non-receptor type 1
Name:Tyrosine-protein phosphatase non-receptor type 1
Type:Protein phosphatase
Mol. Mass.:49963.76
Organism:Homo sapiens (Human)
Description:Human recombinant GST-fusion PTP1B (1-435).
Residue:435
BDBM50317432
NameBDBM50317432
Synonyms:CHEMBL1098728 | NEORAUTENOL
TypeSmall organic molecule
Emp. Form.C20H18O4
Mol. Mass.322.3545
SMILESCC1(C)Oc2cc3OC[C@@H]4[C@@H](Oc5cc(O)ccc45)c3cc2C=C1