Reaction Details
TargetSialidase-2
LigandBDBM50314988
Substrate/Competitorn/a
Meas. Tech.ChEMBL_623928 (CHEMBL1108053)
Ki 880000±n/a nM
Citation Chavas, LMKato, RSuzuki, Nvon Itzstein, MMann, MCThomson, RJDyason, JCMcKimm-Breschkin, JFusi, PTringali, CVenerando, BTettamanti, GMonti, EWakatsuki, S Complexity in influenza virus targeted drug design: interaction with human sialidases. J Med Chem53:2998-3002 (2010) 
 
Sialidase-2
Name:Sialidase-2
Type:PROTEIN
Mol. Mass.:42256.20
Organism:Homo sapiens (Human)
Description:ChEMBL_960638
Residue:380
BDBM50314988
NameBDBM50314988
Synonyms:(2S,3R,4R)-3-acetamido-4-hydroxy-2-isobutoxy-3,4-dihydro-2H-pyran-6-carboxylic acid | CHEMBL1093460
TypeSmall organic molecule
Emp. Form.C12H19NO6
Mol. Mass.273.2824
SMILESCC(C)CO[C@H]1OC(=C[C@@H](O)[C@H]1NC(C)=O)C(O)=O