Reaction Details
TargetAurora kinase B
LigandBDBM50316500
Substrate/Competitorn/a
Meas. Tech.ChEMBL_630516 (CHEMBL1104788)
IC50 64±n/a nM
Citation Adams, NDAdams, JLBurgess, JLChaudhari, AMCopeland, RADonatelli, CADrewry, DHFisher, KEHamajima, THardwicke, MAHuffman, WFKoretke-Brown, KKLai, ZVMcDonald, OBNakamura, HNewlander, KAOleykowski, CAParrish, CAPatrick, DRPlant, RSarpong, MASasaki, KSchmidt, SJSilva, DJSutton, DTang, JThompson, CSTummino, PJWang, JCXiang, HYang, JDhanak, D Discovery of GSK1070916, a potent and selective inhibitor of Aurora B/C kinase. J Med Chem53:3973-4001 (2010) 
 
Aurora kinase B
Name:Aurora kinase B
Type:Protein
Mol. Mass.:39327.72
Organism:Homo sapiens (Human)
Description:Q96GD4
Residue:344
BDBM50316500
NameBDBM50316500
Synonyms:2-[3-(4-{[(Phenylamino)carbonyl]amino}phenyl)-4-(1H-pyrrolo-[2,3-b]pyridin-4-yl)-1H-pyrazol-1-yl]acetamide | CHEMBL1094505
TypeSmall organic molecule
Emp. Form.C25H21N7O2
Mol. Mass.451.4799
SMILESNC(=O)Cn1cc(c(n1)-c1ccc(NC(=O)Nc2ccccc2)cc1)-c1ccnc2[nH]ccc12