Reaction Details
TargetAurora kinase B
LigandBDBM50316489
Substrate/Competitorn/a
Meas. Tech.ChEMBL_630516 (CHEMBL1104788)
IC50 83±n/a nM
Citation Adams, NDAdams, JLBurgess, JLChaudhari, AMCopeland, RADonatelli, CADrewry, DHFisher, KEHamajima, THardwicke, MAHuffman, WFKoretke-Brown, KKLai, ZVMcDonald, OBNakamura, HNewlander, KAOleykowski, CAParrish, CAPatrick, DRPlant, RSarpong, MASasaki, KSchmidt, SJSilva, DJSutton, DTang, JThompson, CSTummino, PJWang, JCXiang, HYang, JDhanak, D Discovery of GSK1070916, a potent and selective inhibitor of Aurora B/C kinase. J Med Chem53:3973-4001 (2010) 
 
Aurora kinase B
Name:Aurora kinase B
Type:Protein
Mol. Mass.:39327.72
Organism:Homo sapiens (Human)
Description:Q96GD4
Residue:344
BDBM50316489
NameBDBM50316489
Synonyms:CHEMBL1095989 | N-(4-{1-Ethyl-4-[2-({[3-(4-methyl-1-piperazinyl)propyl]amino}-methyl)-1H-pyrrolo[2,3-b]pyridin-4-yl]-1H-pyrazol-3-yl}phenyl)-N'-phenylurea
TypeSmall organic molecule
Emp. Form.C34H41N9O
Mol. Mass.591.749
SMILESCCn1cc(c(n1)-c1ccc(NC(=O)Nc2ccccc2)cc1)-c1ccnc2[nH]c(CNCCCN3CCN(C)CC3)cc12