Reaction Details
TargetAurora kinase A
LigandBDBM50316476
Substrate/Competitorn/a
Meas. Tech.ChEMBL_630519 (CHEMBL1104791)
IC50 414±n/a nM
Citation Adams, NDAdams, JLBurgess, JLChaudhari, AMCopeland, RADonatelli, CADrewry, DHFisher, KEHamajima, THardwicke, MAHuffman, WFKoretke-Brown, KKLai, ZVMcDonald, OBNakamura, HNewlander, KAOleykowski, CAParrish, CAPatrick, DRPlant, RSarpong, MASasaki, KSchmidt, SJSilva, DJSutton, DTang, JThompson, CSTummino, PJWang, JCXiang, HYang, JDhanak, D Discovery of GSK1070916, a potent and selective inhibitor of Aurora B/C kinase. J Med Chem53:3973-4001 (2010) 
 
Aurora kinase A
Name:Aurora kinase A
Type:Serine/threonine-protein kinase
Mol. Mass.:45830.98
Organism:Homo sapiens (Human)
Description:O14965
Residue:403
BDBM50316476
NameBDBM50316476
Synonyms:CHEMBL1097521 | N'-[4-(1-Ethyl-4-{2-[4-(1-pyrrolidinylmethyl)phenyl]-1H-pyrrolo[2,3-b]pyridin-4-yl}-1H-pyrazol-3-yl)phenyl]-N,N-dimethylurea
TypeSmall organic molecule
Emp. Form.C32H35N7O
Mol. Mass.533.6666
SMILESCCn1cc(c(n1)-c1ccc(NC(=O)N(C)C)cc1)-c1ccnc2[nH]c(cc12)-c1ccc(CN2CCCC2)cc1