Reaction Details
TargetAurora kinase A
LigandBDBM50316486
Substrate/Competitorn/a
Meas. Tech.ChEMBL_630519 (CHEMBL1104791)
IC50 5477±n/a nM
Citation Adams, NDAdams, JLBurgess, JLChaudhari, AMCopeland, RADonatelli, CADrewry, DHFisher, KEHamajima, THardwicke, MAHuffman, WFKoretke-Brown, KKLai, ZVMcDonald, OBNakamura, HNewlander, KAOleykowski, CAParrish, CAPatrick, DRPlant, RSarpong, MASasaki, KSchmidt, SJSilva, DJSutton, DTang, JThompson, CSTummino, PJWang, JCXiang, HYang, JDhanak, D Discovery of GSK1070916, a potent and selective inhibitor of Aurora B/C kinase. J Med Chem53:3973-4001 (2010) 
 
Aurora kinase A
Name:Aurora kinase A
Type:Serine/threonine-protein kinase
Mol. Mass.:45830.98
Organism:Homo sapiens (Human)
Description:O14965
Residue:403
BDBM50316486
NameBDBM50316486
Synonyms:CHEMBL1096491 | N-(4-{4-[2-({[2-(Dimethylamino)ethyl]amino}methyl)-1Hpyrrolo[2,3-b]pyridin-4-yl]-1-ethyl-1H-pyrazol-3-yl}phenyl)-N'-phenylurea
TypeSmall organic molecule
Emp. Form.C30H34N8O
Mol. Mass.522.644
SMILESCCn1cc(c(n1)-c1ccc(NC(=O)Nc2ccccc2)cc1)-c1ccnc2[nH]c(CNCCN(C)C)cc12