Reaction Details
TargetAurora kinase A
LigandBDBM50316496
Substrate/Competitorn/a
Meas. Tech.ChEMBL_630519 (CHEMBL1104791)
IC50 792±n/a nM
Citation Adams, NDAdams, JLBurgess, JLChaudhari, AMCopeland, RADonatelli, CADrewry, DHFisher, KEHamajima, THardwicke, MAHuffman, WFKoretke-Brown, KKLai, ZVMcDonald, OBNakamura, HNewlander, KAOleykowski, CAParrish, CAPatrick, DRPlant, RSarpong, MASasaki, KSchmidt, SJSilva, DJSutton, DTang, JThompson, CSTummino, PJWang, JCXiang, HYang, JDhanak, D Discovery of GSK1070916, a potent and selective inhibitor of Aurora B/C kinase. J Med Chem53:3973-4001 (2010) 
 
Aurora kinase A
Name:Aurora kinase A
Type:Serine/threonine-protein kinase
Mol. Mass.:45830.98
Organism:Homo sapiens (Human)
Description:O14965
Residue:403
BDBM50316496
NameBDBM50316496
Synonyms:CHEMBL1099010 | N-{4-[1-(2-Hydroxyethyl)-4-(1H-pyrrolo[2,3-b]pyridin-4-yl)-1H-pyrazol-3-yl]phenyl}-N'-phenylurea
TypeSmall organic molecule
Emp. Form.C25H22N6O2
Mol. Mass.438.4812
SMILESOCCn1cc(c(n1)-c1ccc(NC(=O)Nc2ccccc2)cc1)-c1ccnc2[nH]ccc12