Reaction Details
TargetAurora kinase A
LigandBDBM50316502
Substrate/Competitorn/a
Meas. Tech.ChEMBL_630519 (CHEMBL1104791)
IC50 6810±n/a nM
Citation Adams, NDAdams, JLBurgess, JLChaudhari, AMCopeland, RADonatelli, CADrewry, DHFisher, KEHamajima, THardwicke, MAHuffman, WFKoretke-Brown, KKLai, ZVMcDonald, OBNakamura, HNewlander, KAOleykowski, CAParrish, CAPatrick, DRPlant, RSarpong, MASasaki, KSchmidt, SJSilva, DJSutton, DTang, JThompson, CSTummino, PJWang, JCXiang, HYang, JDhanak, D Discovery of GSK1070916, a potent and selective inhibitor of Aurora B/C kinase. J Med Chem53:3973-4001 (2010) 
 
Aurora kinase A
Name:Aurora kinase A
Type:Serine/threonine-protein kinase
Mol. Mass.:45830.98
Organism:Homo sapiens (Human)
Description:O14965
Residue:403
BDBM50316502
NameBDBM50316502
Synonyms:CHEMBL1094507 | N-{4-[1-[2-(4-Morpholinyl)-2-oxoethyl]-4-(1H-pyrrolo[2,3-b]-pyridin-4-yl)-1H-pyrazol-3-yl]phenyl}-N'-phenylurea
TypeSmall organic molecule
Emp. Form.C29H27N7O3
Mol. Mass.521.5698
SMILESO=C(Nc1ccccc1)Nc1ccc(cc1)-c1nn(CC(=O)N2CCOCC2)cc1-c1ccnc2[nH]ccc12