Reaction Details
TargetAurora kinase A
LigandBDBM50316507
Substrate/Competitorn/a
Meas. Tech.ChEMBL_630519 (CHEMBL1104791)
IC50 45±n/a nM
Citation Adams, NDAdams, JLBurgess, JLChaudhari, AMCopeland, RADonatelli, CADrewry, DHFisher, KEHamajima, THardwicke, MAHuffman, WFKoretke-Brown, KKLai, ZVMcDonald, OBNakamura, HNewlander, KAOleykowski, CAParrish, CAPatrick, DRPlant, RSarpong, MASasaki, KSchmidt, SJSilva, DJSutton, DTang, JThompson, CSTummino, PJWang, JCXiang, HYang, JDhanak, D Discovery of GSK1070916, a potent and selective inhibitor of Aurora B/C kinase. J Med Chem53:3973-4001 (2010) 
 
Aurora kinase A
Name:Aurora kinase A
Type:Serine/threonine-protein kinase
Mol. Mass.:45830.98
Organism:Homo sapiens (Human)
Description:O14965
Residue:403
BDBM50316507
NameBDBM50316507
Synonyms:4-[3-(4-N-Phenylcarbamylaminophenyl)-1-ethyl-1H-pyrazol-4-yl]-2-[4-(dimethylaminomethyl)phenyl]-1H-pyrrolo[2,3-b]pyridine | CHEMBL1099347
TypeSmall organic molecule
Emp. Form.C34H33N7O
Mol. Mass.555.6721
SMILESCCn1cc(c(n1)-c1ccc(NC(=O)Nc2ccccc2)cc1)-c1ccnc2[nH]c(cc12)-c1ccc(CN(C)C)cc1