Reaction Details
TargetAurora kinase A
LigandBDBM50241089
Substrate/Competitorn/a
Meas. Tech.ChEMBL_630523 (CHEMBL1104795)
IC50 1400±n/a nM
Citation Adams, NDAdams, JLBurgess, JLChaudhari, AMCopeland, RADonatelli, CADrewry, DHFisher, KEHamajima, THardwicke, MAHuffman, WFKoretke-Brown, KKLai, ZVMcDonald, OBNakamura, HNewlander, KAOleykowski, CAParrish, CAPatrick, DRPlant, RSarpong, MASasaki, KSchmidt, SJSilva, DJSutton, DTang, JThompson, CSTummino, PJWang, JCXiang, HYang, JDhanak, D Discovery of GSK1070916, a potent and selective inhibitor of Aurora B/C kinase. J Med Chem53:3973-4001 (2010) 
 
Aurora kinase A
Name:Aurora kinase A
Type:Serine/threonine-protein kinase
Mol. Mass.:45830.98
Organism:Homo sapiens (Human)
Description:O14965
Residue:403
BDBM50241089
NameBDBM50241089
Synonyms:2-(ethyl(3-(4-(5-(2-(3-fluorophenylamino)-2-oxoethyl)-1H-pyrazol-3-ylamino)quinazolin-7-yloxy)propyl)amino)ethyl dihydrogen phosphate AZD1152, 33 | CHEMBL415049
TypeSmall organic molecule
Emp. Form.C26H31FN7O6P
Mol. Mass.587.5398
SMILESCCN(CCCOc1ccc2c(Nc3cc(CC(=O)Nc4cccc(F)c4)n[nH]3)ncnc2c1)CCOP(O)(O)=O