Reaction Details
TargetDipeptidyl peptidase 4
LigandBDBM50336806
Substrate/Competitorn/a
Meas. Tech.ChEMBL_718678 (CHEMBL1680829)
IC50 1.1±n/a nM
Citation Miyamoto, YBanno, YYamashita, TFujimoto, TOi, SMoritoh, YAsakawa, TKataoka, OYashiro, HTakeuchi, KSuzuki, NIkedo, KKosaka, TTsubotani, STani, ASasaki, MFunami, MAmano, MYamamoto, YAertgeerts, KYano, JMaezaki, H Discovery of a 3-pyridylacetic acid derivative (TAK-100) as a potent, selective and orally active dipeptidyl peptidase IV (DPP-4) inhibitor. J Med Chem54:831-50 (2012) 
 
Dipeptidyl peptidase 4
Name:Dipeptidyl peptidase 4
Type:Enzyme
Mol. Mass.:88271.01
Organism:Homo sapiens (Human)
Description:P27487
Residue:766
BDBM50336806
NameBDBM50336806
Synonyms:1-(3-(aminomethyl)-2-isobutyl-4-p-tolylquinolin-6-yl)piperazine-2,5-dione dihydrochloride | CHEMBL1672113
TypeSmall organic molecule
Emp. Form.C25H28N4O2
Mol. Mass.416.5154
SMILESCC(C)Cc1nc2ccc(cc2c(-c2ccc(C)cc2)c1CN)N1CC(=O)NCC1=O