Reaction Details
TargetMAP kinase-activated protein kinase 2
LigandBDBM50380295
Substrate/Competitorn/a
Meas. Tech.ChEMBL_813702 (CHEMBL2019904)
IC50 6700±n/a nM
Citation Huang, XShipps, GWCheng, CCSpacciapoli, PZhang, XMcCoy, MAWyss, DFYang, XAchab, ASoucy, KMontavon, DKMurphy, DMWhitehurst, CE Discovery and Hit-to-Lead Optimization of Non-ATP Competitive MK2 (MAPKAPK2) Inhibitors. ACS Med Chem Lett2:632-637 (2011) 
 
MAP kinase-activated protein kinase 2
Name:MAP kinase-activated protein kinase 2
Type:Serine/threonine-protein kinase
Mol. Mass.:45579.87
Organism:Homo sapiens (Human)
Description:P49137
Residue:400
BDBM50380295
NameBDBM50380295
Synonyms:CHEMBL2017449
TypeSmall organic molecule
Emp. Form.C21H19ClFN3O2
Mol. Mass.399.846
SMILESFc1cc(NC(=O)c2ccc(o2)-c2ccc(Cl)cc2)ccc1N1CCNCC1