Reaction Details
TargetMAP kinase-activated protein kinase 2
LigandBDBM50380301
Substrate/Competitorn/a
Meas. Tech.ChEMBL_813702 (CHEMBL2019904)
IC50 9500±n/a nM
Citation Huang, XShipps, GWCheng, CCSpacciapoli, PZhang, XMcCoy, MAWyss, DFYang, XAchab, ASoucy, KMontavon, DKMurphy, DMWhitehurst, CE Discovery and Hit-to-Lead Optimization of Non-ATP Competitive MK2 (MAPKAPK2) Inhibitors. ACS Med Chem Lett2:632-637 (2011) 
 
MAP kinase-activated protein kinase 2
Name:MAP kinase-activated protein kinase 2
Type:Serine/threonine-protein kinase
Mol. Mass.:45579.87
Organism:Homo sapiens (Human)
Description:P49137
Residue:400
BDBM50380301
NameBDBM50380301
Synonyms:CHEMBL2017455
TypeSmall organic molecule
Emp. Form.C20H19ClN4OS
Mol. Mass.398.909
SMILESClc1ccc(cc1)-c1nc(cs1)C(=O)Nc1ccc(cc1)N1CCNCC1