Reaction Details
TargetMAP kinase-activated protein kinase 2
LigandBDBM50380298
Substrate/Competitorn/a
Meas. Tech.ChEMBL_813702 (CHEMBL2019904)
IC50 2100±n/a nM
Citation Huang, XShipps, GWCheng, CCSpacciapoli, PZhang, XMcCoy, MAWyss, DFYang, XAchab, ASoucy, KMontavon, DKMurphy, DMWhitehurst, CE Discovery and Hit-to-Lead Optimization of Non-ATP Competitive MK2 (MAPKAPK2) Inhibitors. ACS Med Chem Lett2:632-637 (2011) 
 
MAP kinase-activated protein kinase 2
Name:MAP kinase-activated protein kinase 2
Type:Serine/threonine-protein kinase
Mol. Mass.:45579.87
Organism:Homo sapiens (Human)
Description:P49137
Residue:400
BDBM50380298
NameBDBM50380298
Synonyms:CHEMBL2017452
TypeSmall organic molecule
Emp. Form.C22H19ClN2O2
Mol. Mass.378.851
SMILESClc1ccc(cc1)-c1ccc(o1)C(=O)Nc1ccc(cc1)C1=CCNCC1